N-(p-Cyanophenyl)aziridine

Gas phase ion energetics data

Data compiled as indicated in comments:
LBLHLM - Sharon G. Lias, John E. Bartmess, Joel F. Liebman, John L. Holmes, Rhoda D. Levin, and W. Gary Mallard

Ionization energy determinations

IE (eV) Method Reference Comment
8.5PECrimaldi, Lichter, et al., 1982Vertical value; LBLHLM

References

Crimaldi, Lichter, et al., 1982
Crimaldi, K.; Lichter, R.L.; Baker, A.D., Nitrogen-15 nuclear magnetic resonance and photoelectron spectroscopy of substituted N-ohenylaziridines, J. Org. Chem., 1982, 47, 3524. [all data]