N-Carbamoylmethyl-N-phenylacetamide

Phase change data

Data compiled by: William E. Acree, Jr., James S. Chickos

Enthalpy of sublimation

ΔsubH (kcal/mol) Temperature (K) Method Reference Comment
29.18363.5AStephenson and Malanowski, 1987Based on data from 362. - 365. K. See also Aihara, 1955.

References

Stephenson and Malanowski, 1987
Stephenson, Richard M.; Malanowski, Stanislaw, Handbook of the Thermodynamics of Organic Compounds, 1987, https://doi.org/10.1007/978-94-009-3173-2 . [all data]

Aihara, 1955
Aihara, A., J. Chem. Soc. Jpn. Pure Chem. Sect., 1955, 76, 495. [all data]