phenol, m-isobutyl-

Phase change data

Data compiled by: Thermodynamics Research Center, NIST Boulder Laboratories, Chris Muzny director

Quantity Value Units Method Reference Comment
Tboil513.15KN/APardee and Weinrich, 1944Uncertainty assigned by TRC = 2. K
Quantity Value Units Method Reference Comment
Tfus316.15KN/ABowman, Stevens, et al., 1957Uncertainty assigned by TRC = 2. K
Tfus314.15KN/APardee and Weinrich, 1944Uncertainty assigned by TRC = 2. K

In addition to the Thermodynamics Research Center (TRC) data available from this site, much more physical and chemical property data is available from the following TRC products:

References

Pardee and Weinrich, 1944
Pardee, W.A.; Weinrich, W., Physical properties of alkylated phenols, Ind. Eng. Chem., 1944, 36, 595. [all data]

Bowman, Stevens, et al., 1957
Bowman, R.S.; Stevens, D.R.; Baldwin, W.E., J. Am. Chem. Soc., 1957, 79, 87. [all data]