Butane, 1-propoxy-

Phase change data

Data compiled as indicated in comments:
BS - Robert L. Brown and Stephen E. Stein
TRC - Thermodynamics Research Center, NIST Boulder Laboratories, Chris Muzny director

Quantity Value Units Method Reference Comment
Tboil390.3KN/AWeast and Grasselli, 1989BS
Tboil391.2KN/AMajer and Svoboda, 1985
Tboil389.9KN/ASpurr and Zeitlin, 1950Uncertainty assigned by TRC = 1. K; TRC
Quantity Value Units Method Reference Comment
Δvap40.26kJ/molN/AMajer and Svoboda, 1985

Enthalpy of vaporization

ΔvapH (kJ/mol) Temperature (K) Reference Comment
33.72391.2Majer and Svoboda, 1985

In addition to the Thermodynamics Research Center (TRC) data available from this site, much more physical and chemical property data is available from the following TRC products:

References

Weast and Grasselli, 1989
CRC Handbook of Data on Organic Compounds, 2nd Editon, Weast,R.C and Grasselli, J.G., ed(s)., CRC Press, Inc., Boca Raton, FL, 1989, 1. [all data]

Majer and Svoboda, 1985
Majer, V.; Svoboda, V., Enthalpies of Vaporization of Organic Compounds: A Critical Review and Data Compilation, Blackwell Scientific Publications, Oxford, 1985, 300. [all data]

Spurr and Zeitlin, 1950
Spurr, R.A.; Zeitlin, H., The dipole moments of some aliphatic ethers, J. Am. Chem. Soc., 1950, 72, 4832. [all data]