Cyclooctane, (1-methylethylidene)-

Reaction thermochemistry data

Data compiled by: Hussein Y. Afeefy, Joel F. Liebman, and Stephen E. Stein

Individual Reactions

Cyclooctane, (1-methylethylidene)- = Cyclooctene, 1-isopropyl-

By formula: C11H20 = C11H20

Quantity Value Units Method Reference Comment
Δr-7.4 ± 2.4kJ/molKinBigley and May, 1970liquid phase; solvent: Acetic acid

References

Bigley and May, 1970
Bigley, D.B.; May, R.W., The kinetics of acid-catalysed equilibrations of endo- and exo-cyclic olefins, J. Chem. Soc. B, 1970, 1761-1766. [all data]