Homovanillic acid

Van Den Dool and Kratz RI, non-polar column, custom temperature program

View large format table.

Column type Active phase I Reference Comment
CapillaryDB-5MS1633.Boulanger and Crouzet, 200030. m/0.25 mm/0.25 μm, H2/N2; Program: 40C (5min) => 2C/min => 200C => 5C/min => 250C (15min)

Normal alkane RI, non-polar column, temperature ramp

View large format table.

Column type Active phase I Reference Comment
CapillaryHP-5 MS1659.Jerkovic and Marijanovic, 201030. m/0.25 mm/0.25 μm, Helium, 70. C @ 2. min, 3. K/min, 200. C @ 18. min
CapillarySPB-51685.Kilic, Kollmannsberger, et al., 2005He, 5. K/min; Column length: 30. m; Column diameter: 0.53 mm; Tstart: 100. C; Tend: 250. C
CapillaryDB5-30W1657.Schwab and Schreier, 198830. m/0.25 mm/0.25 μm, He, 5. K/min; Tstart: 60. C; Tend: 300. C

Normal alkane RI, polar column, custom temperature program

View large format table.

Column type Active phase I Reference Comment
CapillaryDB-Wax3099.Loscos, Hernandez-Orte, et al., 200960. m/0.25 mm/0.50 μm, Helium; Program: 40 0C (3 min) 10 0C/min -> 90 0C 2 0C/min -> 230 0C (37 min)
CapillaryDB-Wax Etr3099.Loskos, Hernandez-Orte, et al., 200760. m/0.25 mm/0.5 μm, He; Program: 40C(3min) => 10C/min => 90C => 2C/min => 230C (37min)

References

Boulanger and Crouzet, 2000
Boulanger, R.; Crouzet, J., Free and bound flavour components of Amazonian fruits: 3-glycosidically bound components of cupuacu, Food Chem., 2000, 70, 4, 463-470, https://doi.org/10.1016/S0308-8146(00)00112-6 . [all data]

Jerkovic and Marijanovic, 2010
Jerkovic, I.; Marijanovic, Z., Oak (Quercus frainetto Ten.) honeydaw honey - approach to screening of volatile organic composition and antioxidant capacity (DPPH and FRAP assay), Molecules, 2010, 15, 5, 3744-3756, https://doi.org/10.3390/molecules15053744 . [all data]

Kilic, Kollmannsberger, et al., 2005
Kilic, A.; Kollmannsberger, H.; Nitz, S., Glycosidically bound volatiles and flavor precursors in Laurus nobilis L., J. Agric. Food Chem., 2005, 53, 6, 2231-2235, https://doi.org/10.1021/jf040373+ . [all data]

Schwab and Schreier, 1988
Schwab, W.; Schreier, P., Simultaneous enzyme catalysis extraction: A versatile technique for the study of flavor precursors, J. Agric. Food Chem., 1988, 36, 6, 1238-1242, https://doi.org/10.1021/jf00084a028 . [all data]

Loscos, Hernandez-Orte, et al., 2009
Loscos, N.; Hernandez-Orte, P.; Cacho, J.; Ferreira, V., Fate of grape flavor precursors during storage on yeast lees, J. Agric. Food Chem., 2009, 57, 12, 5468-5479, https://doi.org/10.1021/jf804057q . [all data]

Loskos, Hernandez-Orte, et al., 2007
Loskos, N.; Hernandez-Orte, P.; Cacho, J.; Ferreira, V., Release and formation of varietal aroma compounds during alcoholic fermentation from nonfloral grape odorless flavor precursors fractions, J. Agric. Food Chem., 2007, 55, 16, 6674-6684, https://doi.org/10.1021/jf0702343 . [all data]