3-Pentanol, 2,3,4-trimethyl-

Phase change data

Data compiled by: Thermodynamics Research Center, NIST Boulder Laboratories, Chris Muzny director

Quantity Value Units Method Reference Comment
Tboil429.65KN/AKallina and Kuffner, 1960Uncertainty assigned by TRC = 3. K
Tboil429.65KN/AStas, 1926Uncertainty assigned by TRC = 3. K

In addition to the Thermodynamics Research Center (TRC) data available from this site, much more physical and chemical property data is available from the following TRC products:

References

Kallina and Kuffner, 1960
Kallina; Kuffner, Monatsh. Chem., 1960, 91, 289. [all data]

Stas, 1926
Stas, J., Bull. Soc. Chim. Belg., 1926, 35, 379-86. [all data]