1,1,1,4,5,5,5-heptafluoro-3-(pentafluoroethyl)-2,4-bis(trifluoromethyl)pent-2-ene

Gas phase thermochemistry data

Data compiled by: Hussein Y. Afeefy, Joel F. Liebman, and Stephen E. Stein

Quantity Value Units Method Reference Comment
Δfgas-3753.3 ± 5.3kJ/molCcrZhogina, Papina, et al., 1990

Condensed phase thermochemistry data

Data compiled by: Hussein Y. Afeefy, Joel F. Liebman, and Stephen E. Stein

Quantity Value Units Method Reference Comment
Δfliquid-906.3 ± 1.3kcal/molCcrZhogina, Papina, et al., 1990
Quantity Value Units Method Reference Comment
Δcliquid-712.8 ± 1.2kcal/molCcrZhogina, Papina, et al., 1990

Phase change data

Data compiled by: Hussein Y. Afeefy, Joel F. Liebman, and Stephen E. Stein

Quantity Value Units Method Reference Comment
Δvap9.25 ± 0.07kcal/molCZhogina, Papina, et al., 1990

References

Zhogina, Papina, et al., 1990
Zhogina, E.V.; Papina, T.S.; Kolesov, V.P.; Gervits, L.L.; Makarov, K.N.; Vorob'eva, V.P., Standard enthalpies of formation of hexafluoropropene oligomers, Russ. J. Phys. Chem. (Engl. Transl.), 1990, 64, 1514-1517. [all data]