Amphetamine

Van Den Dool and Kratz RI, non-polar column, temperature ramp

Data compiled by: NIST Mass Spectrometry Data Center, William E. Wallace, director

Column type CapillaryCapillaryPackedPackedPacked
Active phase VF-5MSSPB-1Methyl SiliconeMethyl SiliconeMethyl Silicone
Column length (m) 30.30.
Carrier gas HeHe
Substrate
Column diameter (mm) 0.250.75
Phase thickness (μm) 0.251.0
Tstart (C) 60.160.120.120.120.
Tend (C) 270.280.290.290.290.
Heat rate (K/min)  10.7.7.7.
Initial hold (min)   4.4.4.
Final hold (min)  12.10.10.10.
I 1136.21123.1108.1110.1100.
ReferenceTretyakov, 2014Christ, Noomano, et al., 1988Bogusz, Wijsbeek, et al., 1985Bogusz, Wijsbeek, et al., 1985Bogusz, Wijsbeek, et al., 1985
Comment MSDC-RI MSDC-RI MSDC-RI MSDC-RI MSDC-RI
Column type PackedPackedPackedPackedPacked
Active phase Methyl SiliconeMethyl SiliconeMethyl SiliconeMethyl SiliconeMethyl Silicone
Column length (m)
Carrier gas
Substrate
Column diameter (mm)
Phase thickness (μm)
Tstart (C) 120.120.120.120.120.
Tend (C) 290.290.290.290.290.
Heat rate (K/min) 7.7.7.7.7.
Initial hold (min) 4.4.4.4.4.
Final hold (min) 10.10.10.10.10.
I 1105.1105.1100.1100.1105.
ReferenceBogusz, Wijsbeek, et al., 1985Bogusz, Wijsbeek, et al., 1985Bogusz, Wijsbeek, et al., 1985Bogusz, Wijsbeek, et al., 1985Bogusz, Wijsbeek, et al., 1985
Comment MSDC-RI MSDC-RI MSDC-RI MSDC-RI MSDC-RI
Column type PackedPackedPackedPackedPacked
Active phase Methyl SiliconeMethyl SiliconeMethyl SiliconeMethyl SiliconeMethyl Silicone
Column length (m)
Carrier gas
Substrate
Column diameter (mm)
Phase thickness (μm)
Tstart (C) 120.120.120.120.120.
Tend (C) 290.290.290.290.290.
Heat rate (K/min) 7.7.7.7.7.
Initial hold (min) 4.4.4.4.4.
Final hold (min) 10.10.10.10.10.
I 1120.1110.1110.1110.1110.
ReferenceBogusz, Wijsbeek, et al., 1985Bogusz, Wijsbeek, et al., 1985Bogusz, Wijsbeek, et al., 1985Bogusz, Wijsbeek, et al., 1985Bogusz, Wijsbeek, et al., 1985
Comment MSDC-RI MSDC-RI MSDC-RI MSDC-RI MSDC-RI
Column type PackedPackedPackedPackedCapillary
Active phase Methyl SiliconeMethyl SiliconeMethyl SiliconeMethyl SiliconeDB-1
Column length (m)     15.
Carrier gas     He
Substrate
Column diameter (mm)     0.32
Phase thickness (μm)     0.25
Tstart (C) 120.120.120.120.120.
Tend (C) 290.290.290.290.280.
Heat rate (K/min) 7.7.7.7.8.
Initial hold (min) 4.4.4.4.
Final hold (min) 10.10.10.10.5.
I 1112.1112.1115.1117.1118.
ReferenceBogusz, Wijsbeek, et al., 1985Bogusz, Wijsbeek, et al., 1985Bogusz, Wijsbeek, et al., 1985Bogusz, Wijsbeek, et al., 1985Perrigo, Peel, et al., 1985
Comment MSDC-RI MSDC-RI MSDC-RI MSDC-RI MSDC-RI
Column type CapillaryCapillaryPacked
Active phase DB-1SE-30SE-30
Column length (m) 15.15.1.8
Carrier gas HeHeN2
Substrate   Chromosorb W
Column diameter (mm) 0.250.25
Phase thickness (μm) 0.250.25
Tstart (C) 120.100.130.
Tend (C) 280.295.290.
Heat rate (K/min) 8.5.8.
Initial hold (min)   2.
Final hold (min) 5. 8.
I 1118.1111.1120.
ReferencePerrigo, Ballantyne, et al., 1984Anderson and Stafford, 1983Perrigo and Peel, 1981
Comment MSDC-RI MSDC-RI MSDC-RI

Normal alkane RI, non-polar column, custom temperature program

Data compiled by: NIST Mass Spectrometry Data Center, William E. Wallace, director

Column type CapillaryCapillaryCapillaryCapillaryOther
Active phase 5 % Phenyl methyl siloxane5 % Phenyl methyl siloxanePolymethylsiloxane, (PMS-20000)Polydimethyl siloxanesMethyl Silicone
Column length (m) 25.25.12.
Carrier gas   He
Substrate
Column diameter (mm) 0.200.200.20
Phase thickness (μm) 0.330.330.33
Program 50 0C (0.5 min) 99 0C/min -> 100 0C (1 min) 15 0C/min -> 280 0C (20 min)50 0C (0.5 min) 99 0C/min -> 100 0C (1 min) 15 0C/min -> 280 0C (20 min)not specifiednot specifiednot specified
I 1129.1135.1126.1118.1123.
ReferenceGrigoriev and Savchuk, 2010Grigoriev and Savchuk, 2010Gambaro, Saligari, et al., 1997Zenkevich and Chupalov, 1996Ardrey and Moffat, 1981
Comment MSDC-RI MSDC-RI MSDC-RI MSDC-RI MSDC-RI

Kovats' RI, non-polar column, isothermal

View large format table.

Column type Active phase Temperature (C) I Reference Comment
CapillaryBP-1130.1119.Japp, Gill, et al., 198725. m/0.22 mm/0.25 μm, N2
CapillaryBP-1130.1122.Japp, Gill, et al., 198725. m/0.53 mm/1. μm, N2
PackedSE-30140.1115.Musumarra, Scarlata, et al., 1987N2, 1% se-30 on Anachrom ABS(80-100mesh); Column length: 2. m
PackedOV-101120.1117.Huber, Kenndler, et al., 1979N2; Column length: 2. m
PackedApiezon L120.1132.Huber, Kenndler, et al., 1979
PackedApiezon L120.1132.Donike and Stratmann, 1976Chromosorb W

Kovats' RI, non-polar column, temperature ramp

View large format table.

Column type Active phase I Reference Comment
CapillarySE-301105.Schepers, Wijsbeek, et al., 198225. m/0.49 mm/1.14 μm, 100. C @ 2. min, 8. K/min, 275. C @ 15. min

Kovats' RI, non-polar column, custom temperature program

View large format table.

Column type Active phase I Reference Comment
PackedOV-1011130.McLinden and Stenhouse, 1979N2, Chromosorb W; Column length: 2. m; Program: not specified
PackedSE-301110.Moffat, Stead, et al., 1974Column length: 2. m; Program: not specified

Kovats' RI, polar column, isothermal

View large format table.

Column type Active phase Temperature (C) I Reference Comment
PackedPEG-20M120.1581.Huber, Kenndler, et al., 1979N2
PackedPEG-20M120.1581.Donike and Stratmann, 1976Chromosorb W

Kovats' RI, polar column, custom temperature program

View large format table.

Column type Active phase I Reference Comment
PackedCarbowax 20M1587.Moffat, Stead, et al., 1974Column length: 1. m; Program: not specified

Van Den Dool and Kratz RI, non-polar column, custom temperature program

View large format table.

Column type Active phase I Reference Comment
CapillaryMethyl Silicone1125.University Centre for Pharmacy, 200312.5 m/0.32 mm/1.5 μm; Program: 135C(4min) => 13C/min => 200C => 8C/min => 240C => 6C/min => 312C (6min)

Normal alkane RI, non-polar column, temperature ramp

View large format table.

Column type Active phase I Reference Comment
PackedSE-301123.MHA, 9999Nitrogen, Chromosorb G AW DMCS (80-100 mesh); Column length: 2. m; Tstart: 100. C; Tend: 300. C
CapillaryPolymethylsiloxane, (PMS-20000)1125.Gambaro, Saligari, et al., 199712. m/0.20 mm/0.33 μm, He, 10. K/min; Tstart: 160. C; Tend: 300. C
CapillaryDB-11123.Yashiki, Kojima, et al., 199530. m/0.25 mm/0.25 μm, He, 40. C @ 2. min, 25. K/min, 250. C @ 5. min
CapillaryDB-51110.Phillips, Logan, et al., 199015. m/0.25 mm/0.2 μm, He, 10. K/min; Tstart: 100. C; Tend: 150. C
PackedOV-11145.Marozzi, Gambaro, et al., 1982Gas Chrom P, 2.5 K/min; Column length: 2. m; Tstart: 120. C; Tend: 200. C
PackedSE-301120.Marozzi, Gambaro, et al., 1982Gas Chrom P, 2.5 K/min; Column length: 2. m; Tstart: 120. C; Tend: 200. C
PackedSE-301118.Peel and Perrigo, 1976Nitrogen, Chromosorb W AW DMS (80-100 mesh), 130. C @ 2. min, 8. K/min, 290. C @ 8. min; Column length: 2. m
PackedSE-301118.Peel and Perrigo, 1975N2, Chromosorb W AW DMS, 130. C @ 2. min, 8. K/min, 290. C @ 8. min; Column length: 2. m

References

Tretyakov, 2014
Tretyakov, K.V., Retention Data. NIST Mass Spectrometry Data Center., NIST Mass Spectrometry Data Center, 2014. [all data]

Christ, Noomano, et al., 1988
Christ, D.W.; Noomano, P.; Rosas, M.; Rhone, D., Retention indices by wide-bore capillary gas chromatography with nitrogen-phosphorus detection, J. Anal. Toxicol., 1988, 12, 2, 84-88, https://doi.org/10.1093/jat/12.2.84 . [all data]

Bogusz, Wijsbeek, et al., 1985
Bogusz, M.; Wijsbeek, J.; Franke, J.P.; de Zeeuw, R.A.; Gierz, J., Impact of biological matrix, drug concentration, and method of isolation on detectability and variability of retention index values in gas chromatography, J. Anal. Toxicol., 1985, 9, 2, 49-54, https://doi.org/10.1093/jat/9.2.49 . [all data]

Perrigo, Peel, et al., 1985
Perrigo, B.J.; Peel, H.W.; Ballantyne, D.J., Use of Dual-Column Fused-Silica Capillary Gas Chromatography in Combination with Detector Response Factors for Analytical Toxicology., J. Chromatogr., 1985, 341, 81-88, https://doi.org/10.1016/S0378-4347(00)84011-6 . [all data]

Perrigo, Ballantyne, et al., 1984
Perrigo, B.J.; Ballantyne, D.J.; Peel, H.W., Condierations in developing a data base for drugs on a DBI capillary column, J. Can. Soc. Forensic Sci., 1984, 17, 2, 41-49, https://doi.org/10.1080/00085030.1984.10757360 . [all data]

Anderson and Stafford, 1983
Anderson, W.H.; Stafford, D.T., Applications of capillary gas chromatography in routine toxicological analyses, J. Hi. Res. Chromatogr. Chromatogr. Comm., 1983, 6, 5, 247-254, https://doi.org/10.1002/jhrc.1240060506 . [all data]

Perrigo and Peel, 1981
Perrigo, B.J.; Peel, H.W., The use of retention indices and temperature-programmed gas chromatography in analytical toxicology, J. Chromatogr. Sci., 1981, 19, 5, 219-226, https://doi.org/10.1093/chromsci/19.5.219 . [all data]