C6H6F5NS

Reaction thermochemistry data

Data compiled by: John E. Bartmess

Individual Reactions

C6H5F5NS- + Hydrogen cation = C6H6F5NS

By formula: C6H5F5NS- + H+ = C6H6F5NS

Quantity Value Units Method Reference Comment
Δr1414. ± 8.8kJ/molG+TSTaft, 1987gas phase; value altered from reference due to change in acidity scale
Quantity Value Units Method Reference Comment
Δr1383. ± 8.4kJ/molIMRETaft, 1987gas phase; value altered from reference due to change in acidity scale

References

Taft, 1987
Taft, R.W., The Nature and Analysis of Substitutent Electronic Effects, Personal communication. See also Prog. Phys. Org. Chem., 1987, 16, 1. [all data]