Isopropyl bromoacetate

Kovats' RI, non-polar column, isothermal

View large format table.

Column type Active phase Temperature (C) I Reference Comment
CapillaryOV-10180.916.2Komárek, Hornová, et al., 1982N2; Column length: 15. m; Column diameter: 0.22 mm

Van Den Dool and Kratz RI, non-polar column, temperature ramp

View large format table.

Column type Active phase I Reference Comment
CapillarySE-30906.Korhonen, 19846. K/min; Column length: 25. m; Column diameter: 0.3 mm; Tstart: 50. C
CapillarySE-30906.Korhonen, 19846. K/min; Column length: 25. m; Column diameter: 0.3 mm; Tstart: 50. C

Van Den Dool and Kratz RI, polar column, temperature ramp

View large format table.

Column type Active phase I Reference Comment
CapillaryOV-3511365.Korhonen, 19846. K/min; Column length: 25. m; Column diameter: 0.32 mm; Tstart: 50. C
CapillaryOV-3511365.Korhonen, 19846. K/min; Column length: 25. m; Column diameter: 0.32 mm; Tstart: 50. C

Normal alkane RI, non-polar column, custom temperature program

View large format table.

Column type Active phase I Reference Comment
CapillaryOV-1, SE-30, Methyl silicone, SP-2100, OV-101, DB-1, etc.949.Waggott and Davies, 1984Hydrogen; Column length: 50. m; Column diameter: 0.32 mm; Program: not specified

References

Komárek, Hornová, et al., 1982
Komárek, K.; Hornová, L.; Churácek, J., Glass capillary gas chromatography of homologous series of esters. Separation of homologous series of esters of halogenated carboxylic acids on a glass capillary column with the non-polar stationary silicone phase OV-101, J. Chromatogr., 1982, 244, 1, 142-147, https://doi.org/10.1016/S0021-9673(00)80131-4 . [all data]

Korhonen, 1984
Korhonen, I.O.O., Gas-Liquid Chromatographic Analyses. XXV. Branched-Chain C3-C5 Alkyl Esters of Halogenated Acetic Acids, J. Chromatogr., 1984, 288, 51-69, https://doi.org/10.1016/S0021-9673(01)93681-7 . [all data]

Waggott and Davies, 1984
Waggott, A.; Davies, I.W., Identification of organic pollutants using linear temperature programmed retention indices (LTPRIs) - Part II, 1984, retrieved from http://dwi.defra.gov.uk/research/completed-research/reports/dwi0383.pdf. [all data]