1,3,3-Trinitropiperidine

Phase change data

Data compiled by: William E. Acree, Jr., James S. Chickos

Enthalpy of fusion

ΔfusH (kJ/mol) Temperature (K) Reference
100.4389.2Oxley, Smith, et al., 2001

References

Oxley, Smith, et al., 2001
Oxley, J.C.; Smith, J.L.; Zhang, J.; Bedford, C., A Comparison of the Thermal Decomposition of Nitramines and Difluoramines, J. Phys. Chem. A, 2001, 105, 3, 579-590, https://doi.org/10.1021/jp002516a . [all data]