Hydroxylamine, O-decyl-

Van Den Dool and Kratz RI, non-polar column, custom temperature program

View large format table.

Column type Active phase I Reference Comment
CapillaryDB-51100.Triqui and Reineccius, 199530. m/0.25 mm/1. μm, He; Program: 35C (2min) => 40C/min => 50C (1min) => 6C/min => 250C (10min)

References

Triqui and Reineccius, 1995
Triqui, R.; Reineccius, G.A., Changes in flavor profiles with ripening of anchovy (Engraulis encrasicholus), J. Agric. Food Chem., 1995, 43, 7, 1883-1889, https://doi.org/10.1021/jf00055a024 . [all data]