α,α,α',α'-Tetramethyl-1,4-benzenedimethanol

Condensed phase thermochemistry data

Data compiled by: Hussein Y. Afeefy, Joel F. Liebman, and Stephen E. Stein

Quantity Value Units Method Reference Comment
Δfsolid-543.0 ± 1.5kJ/molCcbVan-Chin-Syan, Dolbneva, et al., 1984
Quantity Value Units Method Reference Comment
Δcsolid-6751.6 ± 1.4kJ/molCcbVan-Chin-Syan, Dolbneva, et al., 1984Corresponding Δfsolid = -543.0 kJ/mol (simple calculation by NIST; no Washburn corrections)

References

Van-Chin-Syan, Dolbneva, et al., 1984
Van-Chin-Syan, Yu.Ya.; Dolbneva, T.N.; Dikii, M.A.; Cuchmarev, S.K., Thermochemistry of derivatives of isopropylbenzene and p-diisopropylbenzene, Russ. J. Phys. Chem. (Engl. Transl.), 1984, 58, 1783-1785. [all data]