o-Nitrobenzilidene-2-naphthylacetontrile

Condensed phase thermochemistry data

Data compiled by: Hussein Y. Afeefy, Joel F. Liebman, and Stephen E. Stein

Quantity Value Units Method Reference Comment
Δfsolid243.6kJ/molCcbCiocazanu, Dogaru, et al., 1978
Quantity Value Units Method Reference Comment
Δcsolid-9434.75kJ/molCcbCiocazanu, Dogaru, et al., 1978

References

Ciocazanu, Dogaru, et al., 1978
Ciocazanu, I.; Dogaru, V.; Bornaz, C.; Spiridon, M.G.; Zavoianu, D., Structura si reactivitatea nitrililor, Revista de Chimie, 1978, 29, 114-116. [all data]