2-Amino-5-methylbenzoic acid

Phase change data

Data compiled by: William E. Acree, Jr., James S. Chickos

Quantity Value Units Method Reference Comment
Δsub26.43 ± 0.45kcal/molMEMonte and Hillesheim, 2001Based on data from 345. - 361. K.

Enthalpy of sublimation

ΔsubH (kcal/mol) Temperature (K) Method Reference Comment
26.0 ± 0.1353.MEMonte and Hillesheim, 2001Based on data from 345. - 361. K.

Enthalpy of fusion

ΔfusH (kcal/mol) Temperature (K) Method Reference
6.604450.DSCMonte and Hillesheim, 2001

References

Monte and Hillesheim, 2001
Monte, Manuel J.S.; Hillesheim, Dorothea M., Thermodynamic study of the sublimation of six aminomethylbenzoic acids, The Journal of Chemical Thermodynamics, 2001, 33, 7, 745-754, https://doi.org/10.1006/jcht.2000.0774 . [all data]