6-Benzothiazolamine,2-methyl-

Gas phase ion energetics data

Data compiled by: Sharon G. Lias, Rhoda D. Levin, and Sherif A. Kafafi

Ionization energy determinations

IE (eV) Method Reference Comment
7.70PESalmona, Faure, et al., 1975Vertical value

References

Salmona, Faure, et al., 1975
Salmona, G.; Faure, R.; Vincent, E.-J., Structure electronique en serie benzothiazolique: Spectres photoelectroniques et calculs C.N.D.O., C.R. Acad. Sci. Ser. 3:, 1975, 280, 605. [all data]