trans-Bicyclo[3.3.0]-octan-2-one

Phase change data

Data compiled by: Hussein Y. Afeefy, Joel F. Liebman, and Stephen E. Stein

Quantity Value Units Method Reference Comment
Δvap54. ± 2.kJ/molVBarrett and Linstead, 1935Heat of formation derived by Cox and Pilcher, 1970

References

Barrett and Linstead, 1935
Barrett, J.W.; Linstead, R.P., Fused carbon rings. Part IV. Further investigation of 0:3:3-bicycloOctanones in relation to the strain theory, J. Chem. Soc., 1935, 436-442. [all data]

Cox and Pilcher, 1970
Cox, J.D.; Pilcher, G., Thermochemistry of Organic and Organometallic Compounds, Academic Press, New York, 1970, 1-636. [all data]