Reaction data
C2H- + Hydrogen cation = Acetylene

Reaction thermochemistry data

Data compiled by: John E. Bartmess

Quantity Value Units Method Reference Comment
Δr1580. ± 20.kJ/molAVGN/AAverage of 8 values; Individual data points
Quantity Value Units Method Reference Comment
Δr1550. ± 20.kJ/molAVGN/AAverage of 7 values; Individual data points

Vibrational and/or electronic energy levels

Data compiled by: Marilyn E. Jacox

State:   ?

 Energy
 (cm-1
 Med.   Transition   λmin
 (nm)
 λmax
 (nm)

References

No reference data available.