2-Nitro-1-pentanol

Kovats' RI, polar column, isothermal

View large format table.

Column type Active phase Temperature (C) I Reference Comment
CapillaryCarbowax 20M413.2140.Boneva and Dimov, 1982N2; Column length: 24. m

References

Boneva and Dimov, 1982
Boneva, S.; Dimov, N., Note. Glass capillary gas chromatography of C2-C5 2-nitro-1-alkanols, J. Chromatogr., 1982, 240, 1, 215-217, https://doi.org/10.1016/S0021-9673(01)84026-7 . [all data]