4H-Pyran

Gas phase ion energetics data

Data compiled as indicated in comments:
LBLHLM - Sharon G. Lias, John E. Bartmess, Joel F. Liebman, John L. Holmes, Rhoda D. Levin, and W. Gary Mallard
LLK - Sharon G. Lias, Rhoda D. Levin, and Sherif A. Kafafi

Ionization energy determinations

IE (eV) Method Reference Comment
8.40EISpilker and Grutzmacher, 1986LBLHLM
8.38 ± 0.02PEBloch, Brogli, et al., 1978Vertical value; LLK

Appearance energy determinations

Ion AE (eV) Other Products MethodReferenceComment
C5H5O+9.91HEISpilker and Grutzmacher, 1986LBLHLM

References

Spilker and Grutzmacher, 1986
Spilker, R.; Grutzmacher, H.-F., Isomerization and fragmentation of methylfuran ions and pyran ions in the gas phase, Org. Mass Spectrom., 1986, 21, 459. [all data]

Bloch, Brogli, et al., 1978
Bloch, M.; Brogli, F.; Heilbronner, E.; Jones, T.B.; Prinzbach, H.; Schweikert, O., 138. Photoelectron spectra of unsaturated oxides. I. 1,4- dioxin and related systems, Helv. Chim. Acta, 1978, 61, 1388. [all data]