Phenazine, 2-nitro-, 10-oxide

Gas phase ion energetics data

Data compiled by: Sharon G. Lias, Rhoda D. Levin, and Sherif A. Kafafi

Ionization energy determinations

IE (eV) Method Reference Comment
8.46PEAlbini and Mark, 1976Vertical value

References

Albini and Mark, 1976
Albini, A.; Mark, F., Photoelectron spectra of phenazine N-oxide and some of its derivatives, J. Chem. Soc. Faraday Trans. 2, 1976, 72, 463. [all data]