Bis(1,1,1,5,5,5-hexafluoro-2,4-pentanedionato)iron

Gas phase ion energetics data

Data compiled by: Henry M. Rosenstock, Keith Draxl, Bruce W. Steiner, and John T. Herron

Ionization energy determinations

IE (eV) Method Reference
9.7 ± 0.1EIReichert, Bancroft, et al., 1970
9.48 ± 0.07EIHoltzclaw, Lintvedt, et al., 1969

Appearance energy determinations

Ion AE (eV) Other Products MethodReferenceComment
C9H2O4F9Fe+13.2 ± 0.2?EIReichert, Bancroft, et al., 1970

References

Reichert, Bancroft, et al., 1970
Reichert, C.; Bancroft, G.M.; Westmore, J.B., Mass spectral studies of metal chelates. V. Mass spectra and appearance potentials of some fluorine-substituted acetylacetonates, Can. J. Chem., 1970, 48, 1362. [all data]

Holtzclaw, Lintvedt, et al., 1969
Holtzclaw, H.F., Jr.; Lintvedt, R.L.; Baumgarten, H.E.; Parker, R.G.; Bursey, M.M.; Rogerson, P.F., Mass spectra of metal chelates. I. Substituent effects on ionization potentials and fragmentation patterns of some 1-methyl-3-alkyl-1,3-dione-copper(II) chelates, J. Am. Chem. Soc., 1969, 91, 3774. [all data]