Disperse Red 11

Phase change data

Data compiled as indicated in comments:
TRC - Thermodynamics Research Center, NIST Boulder Laboratories, Chris Muzny director
AC - William E. Acree, Jr., James S. Chickos

Quantity Value Units Method Reference Comment
Tfus515.KN/ABaughman and Perenich, 1988Uncertainty assigned by TRC = 1. K; TRC

Enthalpy of fusion

ΔfusH (kJ/mol) Temperature (K) Reference Comment
35.29515.2Baughman and Perenich, 1988, 2AC

In addition to the Thermodynamics Research Center (TRC) data available from this site, much more physical and chemical property data is available from the following TRC products:

References

Baughman and Perenich, 1988
Baughman, G.L.; Perenich, T.A., Fate of dyes in aquatic systems: I. Solubility and partitioning of some hydrophobic dyes and related compounds, Environ. Tox. Chem., 1988, 7, 3, 183, https://doi.org/10.1002/etc.5620070302 . [all data]

Baughman and Perenich, 1988, 2
Baughman, George L.; Perenich, Theresa A., Fate of dyes in aquatic systems: I. Solubility and partitioning of some hydrophobic dyes and related compounds, Environ Toxicol Chem, 1988, 7, 3, 183-199, https://doi.org/10.1002/etc.5620070302 . [all data]