Modaline

Normal alkane RI, polar column, isothermal

Data compiled by: NIST Mass Spectrometry Data Center, William E. Wallace, director

Column type CapillaryCapillaryCapillaryCapillaryCapillary
Active phase Carbowax 20M / KOHCarbowax 20M / KOHCarbowax 20M / KOHCarbowax 20M / KOHCarbowax 20M / KOH
Column length (m)
Carrier gas
Substrate
Column diameter (mm)
Phase thickness (μm)
Temperature (C) 150.150.150.190.190.
I 1956.1969.1980.2004.2015.
ReferenceCaddy, Fish, et al., 1973Caddy, Fish, et al., 1973Caddy, Fish, et al., 1973Caddy, Fish, et al., 1973Caddy, Fish, et al., 1973
Comment MSDC-RI MSDC-RI MSDC-RI MSDC-RI MSDC-RI
Column type Capillary
Active phase Carbowax 20M / KOH
Column length (m)
Carrier gas
Substrate
Column diameter (mm)
Phase thickness (μm)
Temperature (C) 190.
I 2027.
ReferenceCaddy, Fish, et al., 1973
Comment MSDC-RI

Normal alkane RI, non-polar column, isothermal

View large format table.

Column type Active phase Temperature (C) I Reference Comment
CapillaryApieson L / KOH150.1465.Caddy, Fish, et al., 1973
CapillaryApieson L / KOH150.1473.Caddy, Fish, et al., 1973
CapillaryApieson L / KOH150.1478.Caddy, Fish, et al., 1973
CapillaryApieson L / KOH190.1495.Caddy, Fish, et al., 1973
CapillaryApieson L / KOH190.1499.Caddy, Fish, et al., 1973
CapillaryApieson L / KOH190.1503.Caddy, Fish, et al., 1973

References

Caddy, Fish, et al., 1973
Caddy, B.; Fish, F.; Scott, D., Chromatographic screening for drugs of abuse using capillary columds. II. Peak identification on support coated open tubular columns for a series of central nervous system stimulating drugs, Chromatographia, 1973, 6, 7, 293-300, https://doi.org/10.1007/BF02269329 . [all data]