Ethanone, 1-(3,4-dihydro-6-methyl-2H-pyran-2-yl)-

Gas phase ion energetics data

Data compiled as indicated in comments:
LBLHLM - Sharon G. Lias, John E. Bartmess, Joel F. Liebman, John L. Holmes, Rhoda D. Levin, and W. Gary Mallard

Ionization energy determinations

IE (eV) Method Reference Comment
8.62PEMorizur, Mercier, et al., 1982LBLHLM

Phase change data

Data compiled by: Robert L. Brown and Stephen E. Stein

Quantity Value Units Method Reference Comment
Tboil452.KN/AAmerican Tokyo Kasei, 1988

References

Morizur, Mercier, et al., 1982
Morizur, J.-P.; Mercier, J.; Sarraf, M., 2-Substituted-2,3-dihydro-4H-pyrans: Competition between 'Retro Diels-Alder' fragmentation and substituent loss, Org. Mass Spectrom., 1982, 17, 327. [all data]