7,8,9-Trioxabicyclo[4.2.1]nonane

Gas phase ion energetics data

Data compiled by: Sharon G. Lias, Rhoda D. Levin, and Sherif A. Kafafi

Ionization energy determinations

IE (eV) Method Reference Comment
9.61 ± 0.03PEBrown and Marcinko, 1978Vertical value

References

Brown and Marcinko, 1978
Brown, R.S.; Marcinko, R.W., Photoelectron spectra of the ozonides of ethylene, cyclopentene, and cyclohexene. Experimental evidence for the magnitude of the "pure" inductive effect of an ether oxygen on ionization energy, J. Am. Chem. Soc., 1978, 100, 5584. [all data]