Bicyclo[3.3.2]decane

Condensed phase thermochemistry data

Data compiled by: Hussein Y. Afeefy, Joel F. Liebman, and Stephen E. Stein

Quantity Value Units Method Reference Comment
Δfsolid-164. ± 7.1kJ/molCcbParker, Steele, et al., 1977
Quantity Value Units Method Reference Comment
Δcsolid-6343.4 ± 7.1kJ/molCcbParker, Steele, et al., 1977Corresponding Δfsolid = -164. kJ/mol (simple calculation by NIST; no Washburn corrections)

Gas phase thermochemistry data

Data compiled by: Hussein Y. Afeefy, Joel F. Liebman, and Stephen E. Stein

Quantity Value Units Method Reference Comment
Δfgas-106. ± 7.5kJ/molCcbParker, Steele, et al., 1977

References

Parker, Steele, et al., 1977
Parker, W.; Steele, W.V.; Watt, I., The standard enthalpies of formation of bicyclo compounds. 2. Bicyclo[3.3.1]nonane and bicyclo[3.3.2]decane, J. Chem. Thermodyn., 1977, 9, 307-310. [all data]