1,1-Diacetoxy-1-phenylethane

Phase change data

Data compiled by: William E. Acree, Jr., James S. Chickos

Enthalpy of sublimation

ΔsubH (kJ/mol) Temperature (K) Method Reference Comment
94.4 ± 2.2318.GSVerevkin, Peng, et al., 1996Based on data from 308. - 338. K.

References

Verevkin, Peng, et al., 1996
Verevkin, S.P.; Peng, W.-H.; Beckhaus, H.D.; Ruchardt, C., Thermochemical study of aliphatic and phenyl-substituted germinal diacetates, Struct. Chem., 1996, 7, 397-404. [all data]