Reaction data
H3+ + Hydrogen = (H3+ • Hydrogen)

Reaction thermochemistry data

Data compiled by: Michael M. Meot-Ner (Mautner) and Sharon G. Lias

Quantity Value Units Method Reference Comment
Δr29. ± 2.kJ/molAVGN/AAverage of 4 out of 11 values; Individual data points
Quantity Value Units Method Reference Comment
Δr72.8 - 72.8J/mol*KRNGN/ARange of 6 values; Individual data points

References

No reference data available.