2-Oxaadamantane

Phase change data

Data compiled as indicated in comments:
TRC - Thermodynamics Research Center, NIST Boulder Laboratories, Chris Muzny director
AC - William E. Acree, Jr., James S. Chickos

Quantity Value Units Method Reference Comment
Tfus567.KN/AAndrews, Carpenter, et al., 1978Uncertainty assigned by TRC = 3. K; TRC

Enthalpy of fusion

ΔfusH (kJ/mol) Temperature (K) Method Reference Comment
8.12567.DSCAndrews, Carpenter, et al., 1978, 2AC

In addition to the Thermodynamics Research Center (TRC) data available from this site, much more physical and chemical property data is available from the following TRC products:

References

Andrews, Carpenter, et al., 1978
Andrews, J.T.S.; Carpenter, R.E.; Martinko, T.M.; Fort, R.C.; Flood, T.A.; Adlington, M.G., Transition and Fusion Thermodynamics of Heteroadamantanes, Mol. Cryst. Liq. Cryst., 1978, 41, 357-61. [all data]

Andrews, Carpenter, et al., 1978, 2
Andrews, J.T.S.; Carpenter, R.E.; Martinko, T.M.; Fort, R.C.; Flood, T.A.; Adlington, M.G., Transition and Fusion Thermodynamics of Heteroadamantanes, Molecular Crystals and Liquid Crystals, 1978, 41, 10, 257-261, https://doi.org/10.1080/00268947808070312 . [all data]