3,4-dimethylcyclohexene

Phase change data

Data compiled by: Thermodynamics Research Center, NIST Boulder Laboratories, Chris Muzny director

Quantity Value Units Method Reference Comment
Tboil398.2KN/AVon Auwers, 1920Uncertainty assigned by TRC = 3. K; probably a mixt. of 3,4- and 4,5-dimethylcyclohexene
Tboil397.2KN/AVon Auwers, 1920Uncertainty assigned by TRC = 3. K; probably a mixt. of 3,4- and 4,5-dimethylcyclohexene

In addition to the Thermodynamics Research Center (TRC) data available from this site, much more physical and chemical property data is available from the following TRC products:

References

Von Auwers, 1920
Von Auwers, K., Relation Between Constitution and Physical Properties of Hydroaromatic Compounds, Justus Liebigs Ann. Chem., 1920, 420, 84-111. [all data]