trans,cis-2,6-Nonadien-1-ol

Van Den Dool and Kratz RI, non-polar column, temperature ramp

View large format table.

Column type Active phase I Reference Comment
CapillarySPB-51170.Rodríguez-Burruezo, Kollmannsberger, et al., 200430. m/0.53 mm/1.5 μm, He, 5. K/min; Tstart: 100. C; Tend: 250. C
CapillaryDB-51160.Flamini, Cioni, et al., 200230. m/0.25 mm/0.25 μm, He, 3. K/min; Tstart: 60. C; Tend: 240. C
CapillaryHP-5MS1169.Kim, Shin, et al., 200130. m/0.25 mm/0.25 μm, He, 40. C @ 5. min, 2. K/min, 200. C @ 20. min
CapillaryHP-5MS1171.Kim, Shin, et al., 200130. m/0.25 mm/0.25 μm, He, 40. C @ 5. min, 2. K/min, 200. C @ 20. min

Van Den Dool and Kratz RI, non-polar column, custom temperature program

View large format table.

Column type Active phase I Reference Comment
CapillarySE-541173.Schuh and Schieberle, 200630. m/0.32 mm/0.25 μm; Program: 40C(2min) => 6C/min => 150C => 20C/min => 230C
CapillarySE-541167.Heiler and Schieberle, 1997Program: not specified

Van Den Dool and Kratz RI, polar column, temperature ramp

View large format table.

Column type Active phase I Reference Comment
CapillaryDB-Wax1766.Kim, Shin, et al., 200130. m/0.25 mm/0.25 μm, He, 40. C @ 5. min, 2. K/min, 200. C @ 20. min
CapillaryDB-Wax1766.Kim, Shin, et al., 200130. m/0.25 mm/0.25 μm, He, 40. C @ 5. min, 2. K/min, 200. C @ 20. min
CapillaryDB-Wax1784.Serot, Prost, et al., 200130. m/0.32 mm/0.5 μm, He, 8. K/min; Tstart: 50. C; Tend: 250. C
CapillaryFFAP1794.Stephan and Steinhart, 199960. m/0.25 mm/0.5 μm, 50. C @ 3. min, 5. K/min, 230. C @ 15. min

Van Den Dool and Kratz RI, polar column, custom temperature program

View large format table.

Column type Active phase I Reference Comment
CapillaryFFAP1759.Schuh and Schieberle, 200630. m/0.32 mm/0.25 μm; Program: 40C(2min) => 6C/min => 150C => 20C/min => 230C

Normal alkane RI, non-polar column, temperature ramp

View large format table.

Column type Active phase I Reference Comment
CapillaryDB-51168.Czerny and Schieberle, 200230. m/0.32 mm/0.25 μm, He, 40. C @ 2. min, 6. K/min, 230. C @ 10. min
CapillaryDB-51168.Czerny and Schieberle, 200230. m/0.32 mm/0.25 μm, He, 40. C @ 2. min, 6. K/min, 230. C @ 10. min
CapillaryDB-11143.Flath, Mon, et al., 198350. C @ 0.1 min, 4. K/min, 250. C @ 5. min; Column length: 60. m; Column diameter: 0.32 mm

Normal alkane RI, non-polar column, custom temperature program

View large format table.

Column type Active phase I Reference Comment
CapillaryHP-5 MS1170.Dharmawan, Kasapis, et al., 200960. m/0.32 mm/1.0 μm, Helium; Program: 120 0C 2 0C/min -> 240 0C 10 0C/min -> 270 0C (2 min)
CapillaryHP-11153.Senger-Emonnot, Rochard, et al., 200650. m/0.32 mm/0.52 μm, He; Program: 40C => 2C/min => 130C => 4C/min => 250C (25min)

Normal alkane RI, polar column, temperature ramp

View large format table.

Column type Active phase I Reference Comment
CapillaryHP-Innowax1750.Senger-Emonnot, Rochard, et al., 200660. m/0.32 mm/0.5 μm, He, 2. K/min, 220. C @ 10. min; Tstart: 60. C
CapillaryDB-FFAP1754.Czerny and Schieberle, 200230. m/0.32 mm/0.25 μm, He, 40. C @ 2. min, 6. K/min, 230. C @ 10. min
CapillaryDB-FFAP1754.Czerny and Schieberle, 200230. m/0.32 mm/0.25 μm, He, 40. C @ 2. min, 6. K/min, 230. C @ 10. min
CapillaryDB-Wax1776.Weckerle, Bastl-Borrmann, et al., 200130. m/0.25 mm/0.25 μm, He, 50. C @ 3. min, 4. K/min; Tend: 220. C
CapillaryDB-Wax1793.Schlüter, Steinhart, et al., 199960. m/0.32 mm/0.5 μm, He, 34. C @ 3. min, 5. K/min, 200. C @ 10. min

References

Rodríguez-Burruezo, Kollmannsberger, et al., 2004
Rodríguez-Burruezo, A.; Kollmannsberger, H.; Prohens, J.; Nitz, S.; Nuez, F., Analysis of the volatile aroma constituents of parental and hybrid clones of pepino (Solanum muricatum), J. Agric. Food Chem., 2004, 52, 18, 5663-5669, https://doi.org/10.1021/jf040107w . [all data]

Flamini, Cioni, et al., 2002
Flamini, G.; Cioni, P.L.; Morelli, I., Analysis of the essential oil of the aerial parts of Viola etrusca from Monte Labbro (South Tuscany, Italy) and in vivo analysis of flower volatiles using SPME, Flavour Fragr. J., 2002, 17, 2, 147-149, https://doi.org/10.1002/ffj.1060 . [all data]

Kim, Shin, et al., 2001
Kim, T.H.; Shin, J.H.; Baek, H.H.; Lee, H.J., Volatile flavour compounds in suspension culture of Agastache rugosa Kuntze (Korean mint), J. Sci. Food Agric., 2001, 81, 6, 569-575, https://doi.org/10.1002/jsfa.845 . [all data]

Schuh and Schieberle, 2006
Schuh, C.; Schieberle, P., Characterization of the Key Aroma Compounds in the Beverage Prepared from Darjeeling Black Tea: Quantitative Differences between Tea Leaves and Infusion, J. Agric. Food Chem., 2006, 54, 3, 916-924, https://doi.org/10.1021/jf052495n . [all data]

Heiler and Schieberle, 1997
Heiler, C.; Schieberle, P., Model studies on the precursors and formation of the metallic smelling (E,Z)-2,6-nonadienol during the manufacture and storage of buttermilk, Int. Dairy J., 1997, 7, 10, 667-674, https://doi.org/10.1016/S0958-6946(97)00069-1 . [all data]

Serot, Prost, et al., 2001
Serot, T.; Prost, C.; Visan, L.; Burcea, M., Identification of the main odor-active compounds in musts from French and Romanian hybrids by three olfactometric methods, J. Agric. Food Chem., 2001, 49, 4, 1909-1914, https://doi.org/10.1021/jf0012291 . [all data]

Stephan and Steinhart, 1999
Stephan, A.; Steinhart, H., Identification of character impact odorants of different soybean lecithins, J. Agric. Food Chem., 1999, 47, 7, 2854-2859, https://doi.org/10.1021/jf981387g . [all data]

Czerny and Schieberle, 2002
Czerny, M.; Schieberle, P., Important aroma compounds in freshly ground wholemeal and white wheat flour-identification and quantitative changes during sourdough fermentation, J. Agric. Food Chem., 2002, 50, 23, 6835-6840, https://doi.org/10.1021/jf020638p . [all data]

Flath, Mon, et al., 1983
Flath, R.A.; Mon, T.R.; Lorenz, G.; Whitten, C.J.; Mackley, J.W., Volatile components of Acacia sp. blossoms, J. Agric. Food Chem., 1983, 31, 6, 1167-1170, https://doi.org/10.1021/jf00120a008 . [all data]

Dharmawan, Kasapis, et al., 2009
Dharmawan, J.; Kasapis, S.; Sriramula, P.; Lear, M.J.; Curran, P., Evaluation of aroma-active compounds in Pontianak orange peel oil (Citrus nobilis Lour. var. microcarpa Hassk.) by gas chromatography - olfactometry, aroma reconstitution, and omission test, J. Agric. Food Chem., 2009, 57, 1, 239-244, https://doi.org/10.1021/jf801070r . [all data]

Senger-Emonnot, Rochard, et al., 2006
Senger-Emonnot, P.; Rochard, S.; Pellegrin, F.; George, G.; Fernandez, X.; Lizzani-Cuvelier, L., Odour active aroma compounds of sea fig (Microcosmus sulcatus), Food Chem., 2006, 97, 3, 465-471, https://doi.org/10.1016/j.foodchem.2005.05.026 . [all data]

Weckerle, Bastl-Borrmann, et al., 2001
Weckerle, B.; Bastl-Borrmann, R.; Richling, E.; Hör, K.; Ruff, C.; Schreier, P., Cactus pear (Opuntia ficus indica) flavour constituents - chiral evaluation (MDGC-MS) and isotope ratio (HRGC-IRMS) analysis, Flavour Fragr. J., 2001, 16, 5, 360-363, https://doi.org/10.1002/ffj.1012 . [all data]

Schlüter, Steinhart, et al., 1999
Schlüter, S.; Steinhart, H.; Schwarz, F.J.; Kirchgessner, M., Changes in the odorants of boiled carp fillet (Cyprinus carpio L.) as affected by increasing methionine levels in feed, J. Agric. Food Chem., 1999, 47, 12, 5146-5150, https://doi.org/10.1021/jf9902604 . [all data]