3-ethoxypropanal

Normal alkane RI, polar column, temperature ramp

Data compiled by: NIST Mass Spectrometry Data Center, William E. Wallace, director

Column type Capillary
Active phase DB-Wax
Column length (m) 30.
Carrier gas Helium
Substrate
Column diameter (mm) 0.25
Phase thickness (μm) 0.25
Tstart (C) 40.
Tend (C) 230.
Heat rate (K/min) 3.
Initial hold (min) 2.
Final hold (min) 5.
I 1191.
ReferenceZhao, Xu, et al., 2009
Comment MSDC-RI

References

Zhao, Xu, et al., 2009
Zhao, Y.; Xu, Y.; Li, J.; Fan, W.; Jiang, W., Profile of volatile compounds in 11 brandies by headspace solid-phase microextraction followed by gas chromatography-mass spectrometry, J. Food. Sci., 2009, 74, 2, c90-c99, https://doi.org/10.1111/j.1750-3841.2008.01029.x . [all data]