C3H5NO

Reaction thermochemistry data

Data compiled by: John E. Bartmess

Individual Reactions

C3H4NO- + Hydrogen cation = C3H5NO

By formula: C3H4NO- + H+ = C3H5NO

Quantity Value Units Method Reference Comment
Δr1533. ± 13.kJ/molG+TSKass, Filley, et al., 1986gas phase
Quantity Value Units Method Reference Comment
Δr1504. ± 13.kJ/molIMRBKass, Filley, et al., 1986gas phase

References

Kass, Filley, et al., 1986
Kass, S.R.; Filley, J.; Van Doren, J.M.; DePuy, C.H., Nitrous oxide in gas-phase ion-molecule chemistry: A versatile reagent for the determination of carbanion structure, J. Am. Chem. Soc., 1986, 108, 2849. [all data]