L-Methionine, 2TMS derivative

Kovats' RI, non-polar column, isothermal

View large format table.

Column type Active phase Temperature (C) I Reference Comment
CapillarySP-2100135.1516.78Gajewski, Dizdaroglu, et al., 1982He; Column length: 12. m; Column diameter: 0.2 mm
CapillarySP-2100150.1518.48Gajewski, Dizdaroglu, et al., 1982He; Column length: 12. m; Column diameter: 0.2 mm
CapillarySE-54120.1531.10Gajewski, Dizdaroglu, et al., 1982He; Column length: 12. m; Column diameter: 0.2 mm

Kovats' RI, non-polar column, temperature ramp

View large format table.

Column type Active phase I Reference Comment
CapillarySP-21001527.51Gajewski, Dizdaroglu, et al., 1982He, 6. K/min; Column length: 12. m; Column diameter: 0.2 mm; Tstart: 80. C; Tend: 250. C

Kovats' RI, non-polar column, custom temperature program

View large format table.

Column type Active phase I Reference Comment
CapillarySE-541541.58Gajewski, Dizdaroglu, et al., 1982He; Column length: 12. m; Column diameter: 0.2 mm; Program: 70C => 4C/min => 170C=8C/min => 250C

Kovats' RI, polar column, isothermal

View large format table.

Column type Active phase Temperature (C) I Reference Comment
CapillaryCarbowax 20M135.1741.00Gajewski, Dizdaroglu, et al., 1982He; Column length: 12. m; Column diameter: 0.2 mm

Van Den Dool and Kratz RI, non-polar column, temperature ramp

View large format table.

Column type Active phase I Reference Comment
CapillaryDB-5MS1513.5Jonsson, Johansson, et al., 200510. m/0.18 mm/0.18 μm, 70. C @ 2. min, 40. K/min, 320. C @ 2. min
CapillaryDB-51530.Fu, Iga, et al., 200030. m/0.25 mm/0.25 μm, He, 100. C @ 1. min, 10. K/min, 290. C @ 8. min
PackedOV-11530.Butts, 1972He, Chromosorb W HP (80-100 mesh), 10. K/min; Column length: 2. m; Tstart: 100. C; Tend: 325. C

Van Den Dool and Kratz RI, non-polar column, custom temperature program

View large format table.

Column type Active phase I Reference Comment
CapillaryVF-5MS1508.2Tret'yakov, 200730. m/0.25 mm/0.25 μm, He; Program: Multi-step temperature program; T(initial)=60C; T(final)=270C

Normal alkane RI, non-polar column, temperature ramp

View large format table.

Column type Active phase I Reference Comment
CapillaryHP-5MS1534.Lee, Yanamandra, et al., 200230. m/0.25 mm/0.25 μm, He, 70. C @ 3. min, 4. K/min, 280. C @ 3. min

References

Gajewski, Dizdaroglu, et al., 1982
Gajewski, E.; Dizdaroglu, M.; Simic, M.G., Kovats' Indices of Trimethylsilylated Amino Acids on Fused-Silica Capillary Columns, J. Chromatogr., 1982, 249, 1, 41-55, https://doi.org/10.1016/S0021-9673(00)80231-9 . [all data]

Jonsson, Johansson, et al., 2005
Jonsson, P.; Johansson, A.I.; Gullberg, J.; Trygg, J.; Jiye, A.; Grung, B.; Marklund, S.; Sjöström, M.; Antti, H.; Moritz, T., High-throughput data analysis for detecting and identifying differences between samples in GC/MS-based metabolomic analyses, Anal. Chem., 2005, 77, 17, 5635-5642, https://doi.org/10.1021/ac050601e . [all data]

Fu, Iga, et al., 2000
Fu, X.; Iga, M.; Kimura, M.; Yamaguchi, S., Simplified screening for organic acidemia using GC/MS and dried urine filter paper: a study on neonatal mass screening, Early Hum. Dev., 2000, 58, 1, 41-55, https://doi.org/10.1016/S0378-3782(00)00053-0 . [all data]

Butts, 1972
Butts, W.C., Two-Column Gas Chromatography of Trimethylsilyl Derivatives of Biochemically Significant Compounds, Anal. Biochemistry, 1972, 46, 1, 187-199, https://doi.org/10.1016/0003-2697(72)90411-3 . [all data]

Tret'yakov, 2007
Tret'yakov, K.V., Retention Data. NIST Mass Spectrometry Data Center., NIST Mass Spectrometry Data Center, 2007. [all data]

Lee, Yanamandra, et al., 2002
Lee, B.Y.; Yanamandra, K.; Thurmon, T.F., Quantitative estimation of organic analytes with a capillary column, Am. Clin. Lab., 2002, May, 30-34. [all data]