Tricyclo[4.2.1.02,5]nona-3,7-diene,9-(1-methylethylidene)-,(1α,2α,5α,6α)-

Gas phase ion energetics data

Data compiled by: Sharon G. Lias, Rhoda D. Levin, and Sherif A. Kafafi

Ionization energy determinations

IE (eV) Method Reference Comment
8.33 ± 0.03PEMartin, Kagabu, et al., 1974Vertical value

References

Martin, Kagabu, et al., 1974
Martin, H.-D.; Kagabu, S.; Schwesinger, R., Photoelektronenspektroskopische untersuchung der intramolekularen π,π-wechselwirkungen in endo-tricyclo[4.2.1.02,5]- nonadienen. Homokonjugation mit cyclobutanen, Chem. Ber., 1974, 107, 3130. [all data]