Tramadol

Van Den Dool and Kratz RI, non-polar column, temperature ramp

View large format table.

Column type Active phase I Reference Comment
CapillaryVF-5MS1991.3Tretyakov, 201430. m/0.25 mm/0.25 μm, He; Tstart: 60. C; Tend: 270. C

Normal alkane RI, non-polar column, custom temperature program

View large format table.

Column type Active phase I Reference Comment
Capillary5 % Phenyl methyl siloxane1999.Grigoriev and Savchuk, 201025. m/0.20 mm/0.33 μm; Program: 50 0C (0.5 min) 99 0C/min -> 100 0C (1 min) 15 0C/min -> 280 0C (20 min)
CapillaryHP-11945.Grigor'ev, Bozhko, et al., 2009Helium; Program: not specified

References

Tretyakov, 2014
Tretyakov, K.V., Retention Data. NIST Mass Spectrometry Data Center., NIST Mass Spectrometry Data Center, 2014. [all data]

Grigoriev and Savchuk, 2010
Grigoriev, A.M.; Savchuk, S.A., Correlation of the parameters of screening libraries of the gas-chromatographic retention data, Rus. J. Anal. Chem. (Engl. Transl.), 2010, 65, 4, 388-397. [all data]

Grigor'ev, Bozhko, et al., 2009
Grigor'ev, A.M.; Bozhko, E.S.; Rudakova, L.V., Use of correlation between retention indices on low-polarity phases for screening comp-lex mixtures by gas chromatography-mass spectrometry, Rus. J. Anal. Chem., 2009, 64, 2, 140-143, https://doi.org/10.1134/S1061934809020087 . [all data]