Naphthalene, 1,2,4-trimethyl-

Lee's RI, non-polar column, custom temperature program

Data compiled by: NIST Mass Spectrometry Data Center, William E. Wallace, director

Column type CapillaryCapillary
Active phase DB-5CP Sil 8 CB
Column length (m) 30.50.
Carrier gas HeHe
Substrate
Column diameter (mm) 0.250.25
Phase thickness (μm) 0.250.25
Program 60 0C (3 min) 10 0C/min -> 100 0C (3 min) 5 0C/min -> 300 0Cnot specified
I 268.5268.3
ReferencePaschke, Herbel, et al., 1992Bundt, Herbel, et al., 1991
Comment MSDC-RI MSDC-RI

Phase change data

Data compiled by: Thermodynamics Research Center, NIST Boulder Laboratories, Chris Muzny director

Quantity Value Units Method Reference Comment
Tfus328.KN/AKloetzel, 1940Uncertainty assigned by TRC = 4. K

In addition to the Thermodynamics Research Center (TRC) data available from this site, much more physical and chemical property data is available from the following TRC products:

Kovats' RI, non-polar column, isothermal

View large format table.

Column type Active phase Temperature (C) I Reference Comment
CapillaryApiezon L200.1575.Klemm, Shabtai, et al., 1981

Lee's RI, non-polar column, temperature ramp

View large format table.

Column type Active phase I Reference Comment
CapillaryDB-5MS269.23Sun, Zhou, et al., 200830. m/0.25 mm/0.25 μm, 50. C @ 2. min, 6. K/min, 300. C @ 16. min
CapillaryPTE-5268.54Wang, Jia, et al., 200030. m/0.25 mm/0.25 μm, 60. C @ 1.5 min, 8. K/min, 300. C @ 12.5 min
CapillaryCP Sil 8 CB269.3Bundt, Herbel, et al., 199150. m/0.25 mm/0.25 μm, He, 4. K/min; Tstart: 80. C; Tend: 300. C
CapillaryDB-5268.29Forster, Alexander, et al., 1989H2, 2. K/min, 300. C @ 10. min; Column length: 60. m; Column diameter: 0.20 mm; Tstart: 70. C

References

Paschke, Herbel, et al., 1992
Paschke, A.; Herbel, W.; Steinhart, H.; Franke, S.; Francke, W., Determination of mono- to tetracyclic aromatic hydrocarbons in lubricating oil, J. Hi. Res. Chromatogr., 1992, 15, 12, 827-833, https://doi.org/10.1002/jhrc.1240151211 . [all data]

Bundt, Herbel, et al., 1991
Bundt, J.; Herbel, W.; Steinhart, H.; Franke, S.; Francke, W., Structure-type separation of diesel fuels by solid phase extraction and identification of the two- and three-ring aromatics by capillary GC-mass spectrometry, J. Hi. Res. Chromatogr., 1991, 14, 2, 91-98, https://doi.org/10.1002/jhrc.1240140205 . [all data]