Diphosphine, tetrakis(trifluoromethyl)-

Gas phase ion energetics data

Data compiled by: Sharon G. Lias, Rhoda D. Levin, and Sherif A. Kafafi

Ionization energy determinations

IE (eV) Method Reference Comment
10.71PECowley, Dewar, et al., 1974Vertical value
10.71PECowley, Dewar, et al., 1974, 2Vertical value
11.57PECowley, Dewar, et al., 1974, 2Vertical value

References

Cowley, Dewar, et al., 1974
Cowley, A.H.; Dewar, M.J.S.; Goodman, D.W.; Padolina, M.C., A photoelectron spectroscopic study of polyphosphines. The question of pπ:dπ bonding, J. Am. Chem. Soc., 1974, 96, 3666. [all data]

Cowley, Dewar, et al., 1974, 2
Cowley, A.H.; Dewar, M.J.S.; Goodman, D.W.; Padolina, M.C., Detection of rotational isomerism in diphosphines and diarsines by photoelectron spectroscopy, J. Am. Chem. Soc., 1974, 96, 2648. [all data]