Octane, 1,1'-thiobis-

Kovats' RI, non-polar column, isothermal

View large format table.

Column type Active phase Temperature (C) I Reference Comment
PackedSE-3080.1875.Zotov, Golovkin, et al., 1981N2, Chromaton N-AWHMDS; Column length: 1.8 m
PackedSE-30190.1892.Golovkin, Smol'chenko, et al., 1980N2, Chromaton N-AW-DMCS; Column length: 1. m
PackedSE-30110.1838.Möckel and Zolg, 1977Chromosorb W AW (80-100 mesh); Column length: 2. m

Kovats' RI, polar column, isothermal

View large format table.

Column type Active phase Temperature (C) I Reference Comment
PackedCarbowax 20M110.2048.Möckel and Zolg, 1977He, Chromosorb W AW (80-100 mesh); Column length: 6. m

Van Den Dool and Kratz RI, non-polar column, temperature ramp

View large format table.

Column type Active phase I Reference Comment
PackedSE-301885.Zotov, Golovkin, et al., 1981N2, Chromaton N-AWHMDS, 3.9 K/min; Column length: 1.8 m; Tstart: 80. C; Tend: 250. C

Normal alkane RI, non-polar column, custom temperature program

View large format table.

Column type Active phase I Reference Comment
CapillaryOV-1, SE-30, Methyl silicone, SP-2100, OV-101, DB-1, etc.1885.Waggott and Davies, 1984Hydrogen; Column length: 50. m; Column diameter: 0.32 mm; Program: not specified

References

Zotov, Golovkin, et al., 1981
Zotov, L.N.; Golovkin, G.V.; Golovnya, R.V., GC Behaviour of Symmetrical n-Dialkyl Sulphides under Isothermal and Temperature Programming Conditions, J. Hi. Res. Chromatogr. Chromatogr. Comm., 1981, 4, 1, 6-10, https://doi.org/10.1002/jhrc.1240040103 . [all data]

Golovkin, Smol'chenko, et al., 1980
Golovkin, G.V.; Smol'chenko, A.I.; Zotov, L.N.; Sazonov, S.E., Systems of gas-chromatographic retention indices for identifying pesticides by means of selective detectors, Zh. Anal. Khim., 1980, 35, 5, 651-655. [all data]

Möckel and Zolg, 1977
Möckel, H.J.; Zolg, M., Retentionsindices n-aliphatischer Schwefelverbindungen, Z. Anal. Chem., 1977, 285, 1, 45-46, https://doi.org/10.1007/BF00446017 . [all data]

Waggott and Davies, 1984
Waggott, A.; Davies, I.W., Identification of organic pollutants using linear temperature programmed retention indices (LTPRIs) - Part II, 1984, retrieved from http://dwi.defra.gov.uk/research/completed-research/reports/dwi0383.pdf. [all data]