Propanamide, N,2-dimethyl-

Phase change data

Data compiled by: William E. Acree, Jr., James S. Chickos

Quantity Value Units Method Reference Comment
Δvap67.1 ± 0.2kJ/molCStarzewski, Wadso, et al., 1984

References

Starzewski, Wadso, et al., 1984
Starzewski, P.; Wadso, I.; Zielenkiewicz, W., Enthalpies of vaporization of some N-alkylamides at 298.15 K, J. Chem. Thermodyn., 1984, 16, 331-334. [all data]