3,4-Dicyclohexyl-3,4-dimethylhexane

Phase change data

Data compiled by: William E. Acree, Jr., James S. Chickos

Enthalpy of vaporization

ΔvapH (kJ/mol) Temperature (K) Reference Comment
78.4359.Dykyj, Svoboda, et al., 1999Based on data from 343. - 365. K. See also Beckhaus, Kratt, et al., 1980.

References

Dykyj, Svoboda, et al., 1999
Dykyj, J.; Svoboda, J.; Wilhoit, R.C.; Frenkel, M.L.; Hall, K.R., Vapor Pressure of Chemicals: Part A. Vapor Pressure and Antoine Constants for Hydrocarbons and Sulfur, Selenium, Tellurium and Hydrogen Containing Organic Compounds, Springer, Berlin, 1999, 373. [all data]

Beckhaus, Kratt, et al., 1980
Beckhaus, H-D.; Kratt, G.; Lay, K.; Geiselmann, J.; Ruchardt, C.; Kitschke, B.; Lindner, H.J., 3,4-dicyclohexyl-3,4-dimethylhexan - Standardbildungsenthalpie, thermische Stabilitat und Struktur, Chem. Ber., 1980, 113, 3441-3455. [all data]