1,4-Pentadiene, 3-ethenyl-

Gas phase ion energetics data

Data compiled as indicated in comments:
LBLHLM - Sharon G. Lias, John E. Bartmess, Joel F. Liebman, John L. Holmes, Rhoda D. Levin, and W. Gary Mallard

Ionization energy determinations

IE (eV) Method Reference Comment
9.1PEGleiter, Haider, et al., 1983LBLHLM
9.5PEGleiter, Haider, et al., 1983Vertical value; LBLHLM

References

Gleiter, Haider, et al., 1983
Gleiter, R.; Haider, R.; Bischof, P.; Lindner, J.-J., Zur konformation von tetravinyl- und trivinylmethan - vergleich er PE-spektren von tetravinylmethan mit trans, trans, trans-1,2,3,4-tetravinylcyclobutan, Chem. Ber., 1983, 116, 3736. [all data]