Phenoxaselenin

Gas phase ion energetics data

Data compiled by: Sharon G. Lias, Rhoda D. Levin, and Sherif A. Kafafi

Ionization energy determinations

IE (eV) Method Reference Comment
7.74 ± 0.05PEColonna, Distefano, et al., 1978Vertical value

References

Colonna, Distefano, et al., 1978
Colonna, F.P.; Distefano, G.; Galasso, V.; Irgolic, K.J.; King, C.E.; Pappalardo, G.C., The conformation, uv-absorption spectra and photoelectron spectra of phenoxachalcogenins, J. Organometal. Chem., 1978, 146, 235. [all data]