Pyridazine,hexahydro-1,2,3,6-tetramethyl,cis-

Gas phase ion energetics data

Data compiled by: Sharon G. Lias, Rhoda D. Levin, and Sherif A. Kafafi

Ionization energy determinations

IE (eV) Method Reference Comment
7.76PENelsen, Peacock, et al., 1976Vertical value
7.76PENelsen and Buschek, 1974Vertical value
7.82PENelsen, Buschek, et al., 1973Vertical value

References

Nelsen, Peacock, et al., 1976
Nelsen, S.F.; Peacock, V.; Weisman, G.R., Single-electron oxidation equilibria of tetraalkylhydrazines. Comparison of solution E° values and vapor-phase ionization potentials, J. Am. Chem. Soc., 1976, 98, 5269. [all data]

Nelsen and Buschek, 1974
Nelsen, S.F.; Buschek, J.M., Photoelectron spectra of hydrazines. V. Pyrazolidine and hexahydropyridazine derivatives, J. Am. Chem. Soc., 1974, 96, 6987. [all data]

Nelsen, Buschek, et al., 1973
Nelsen, S.F.; Buschek, J.M.; Hintz, P.J., Photoelectron spectra of hydrazines. II. Conformations of hexahydropyridazines, J. Am. Chem. Soc., 1973, 95, 2013. [all data]