1-Pentanamine, N,N-dimethyl-

Phase change data

Data compiled by: Thermodynamics Research Center, NIST Boulder Laboratories, Chris Muzny director

Quantity Value Units Method Reference Comment
Tboil395.15KN/AGautier, Renault, et al., 1957Uncertainty assigned by TRC = 3. K
Tboil395.65KN/ASwann, 1943Uncertainty assigned by TRC = 3. K

In addition to the Thermodynamics Research Center (TRC) data available from this site, much more physical and chemical property data is available from the following TRC products:

References

Gautier, Renault, et al., 1957
Gautier; Renault; Rabiant, Bull. Soc. Chim. Fr., 1957, 1957, 1014. [all data]

Swann, 1943
Swann, Trans. Electrochem. Soc., 1943, 84, 165. [all data]