p-n-Hexyloxybenzylidene-p'-toluidine

Condensed phase thermochemistry data

Data compiled by: Eugene S. Domalski and Elizabeth D. Hearing

Quantity Value Units Method Reference Comment
solid,1 bar448.95J/mol*KN/ATsuji, Sorai, et al., 1982

Constant pressure heat capacity of solid

Cp,solid (J/mol*K) Temperature (K) Reference Comment
441.40298.15Tsuji, Sorai, et al., 1982T = 17 to 385 K.

References

Tsuji, Sorai, et al., 1982
Tsuji, K.; Sorai, M.; Suga, H.; Seki, S., Heat capacity and thermodynamic properties of p'-substituted p-n-hexyloxybenzylideneaniline. IV. p-n-Hexyloxybenzylidene-p'-toluidine (HBT), Mol. Cryst. Liq. Cryst., 1982, 90, 97-110. [all data]