3-Methyl,2-butenoic acid, isopropyl ester

Kovats' RI, non-polar column, isothermal

View large format table.

Column type Active phase Temperature (C) I Reference Comment
PackedSE-30150.940.Ashes and Haken, 1975He, Celatom silanized (62-72 mesh); Column length: 3.7 m

Phase change data

Data compiled by: William E. Acree, Jr., James S. Chickos

Quantity Value Units Method Reference Comment
Δvap12.0 ± 0.05kcal/molGSEmel'yanenko, Toktonov, et al., 2008Based on data from 279. - 313. K.

References

Ashes and Haken, 1975
Ashes, J.R.; Haken, J.K., Gas chromatography of homologous esters. IX. Structure-retention increments of unsaturated esters, J. Chromatogr., 1975, 111, 1, 171-187, https://doi.org/10.1016/S0021-9673(01)80159-X . [all data]