4-amino-α-phenylbenzenemethanol

Phase change data

Data compiled by: Thermodynamics Research Center, NIST Boulder Laboratories, Chris Muzny director

Quantity Value Units Method Reference Comment
Tfus394.65KN/AMontagne, 1923Uncertainty assigned by TRC = 2. K

In addition to the Thermodynamics Research Center (TRC) data available from this site, much more physical and chemical property data is available from the following TRC products:

References

Montagne, 1923
Montagne, P.J., The Action of Alcoholic Potash on Ketones, Recl. Trav. Chim. Pays-Bas, 1923, 42, 499. [all data]